# fehler bei installation mamp pro/macos bigsur

**URL:** https://forum.shopware.com/t/fehler-bei-installation-mamp-pro-macos-bigsur/72815
**Category:** Installation / Einstieg
**Created:** [16. Februar 2021 um 12:15 UTC](https://forum.shopware.com/t/fehler-bei-installation-mamp-pro-macos-bigsur/72815 "2021-02-16T12:15:37Z")
**Posts on this page:** 3
**Page:** 1

<div class="post-metadata">

### Author: ![thx4](https://avatars.discourse-cdn.com/v4/letter/t/48db29/32.png) [@thx4](https://forum.shopware.com/u/thx4)
#### Post date: [16. Februar 2021 um 12:15 UTC](https://forum.shopware.com/t/fehler-bei-installation-mamp-pro-macos-bigsur/72815/1 "2021-02-16T12:15:37Z")

</div>

hi.

&nbsp;

hänge bei schritt 29/42 fest. habe alles nach dem offiziellen guide von shopware gemacht. bekomme extrem viele npm fehler im schritt 29.&nbsp;

&nbsp;

habe gescheckt das das dev verzeichnis bzw die rechte beim user liegen.&nbsp;

&nbsp;

hier mal anfang und ende vom log da das log an sich zu lange ist.&nbsp;

```
(29/42) Starting
> npm clean-install --prefix vendor/shopware/platform/src/Administration/Resources/app/administration
	npm ERR! code 1
	npm ERR! path /Users/jh/PhpstormProjects/shopware/development/vendor/shopware/platform/src/Administration/Resources/app/administration/node_modules/node-sass
	npm ERR! command failed
	npm ERR! command sh -c node scripts/build.js

```

&nbsp;

ende

```
	npm ERR! 2 warnings generated.
	npm ERR! libtool: unrecognized option `-static'
	npm ERR! libtool: Try `libtool --help' for more information.
	npm ERR! make: *** [Release/sass.a] Error 1
	npm ERR! gyp ERR! build error 
	npm ERR! gyp ERR! stack Error: `make` failed with exit code: 2
	npm ERR! gyp ERR! stack at ChildProcess.onExit (/Users/jh/PhpstormProjects/shopware/development/platform/src/Administration/Resources/app/administration/node_modules/node-gyp/lib/build.js:262:23)
	npm ERR! gyp ERR! stack at ChildProcess.emit (node:events:378:20)
	npm ERR! gyp ERR! stack at Process.ChildProcess._handle.onexit (node:internal/child_process:290:12)
	npm ERR! gyp ERR! System Darwin 20.3.0
	npm ERR! gyp ERR! command "/usr/local/Cellar/node/15.8.0/bin/node" "/Users/jh/PhpstormProjects/shopware/development/platform/src/Administration/Resources/app/administration/node_modules/node-gyp/bin/node-gyp.js" "rebuild" "--verbose" "--libsass_ext=" "--libsass_cflags=" "--libsass_ldflags=" "--libsass_library="
	npm ERR! gyp ERR! cwd /Users/jh/PhpstormProjects/shopware/development/platform/src/Administration/Resources/app/administration/node_modules/node-sass
	npm ERR! gyp ERR! node -v v15.8.0
	npm ERR! gyp ERR! node-gyp -v v3.8.0
	npm ERR! gyp ERR! not ok 
	npm ERR! Build failed with error code: 1

```

&nbsp;

---

<div class="post-metadata">

### Author: ![Banane](https://avatars.discourse-cdn.com/v4/letter/b/f475e1/32.png) [@Banane](https://forum.shopware.com/u/Banane)
#### Post date: [17. Februar 2021 um 00:36 UTC](https://forum.shopware.com/t/fehler-bei-installation-mamp-pro-macos-bigsur/72815/2 "2021-02-17T00:36:41Z")

</div>

Ich hatte auch das Problem.  
Node 15 ist zu neu. Mit einem downgrade läuft das Setup durch.

Edit:  
am besten eignet sich die node v12

mit brew kann man ganz einfach switchen

```
brew unlink node
brew install node@12
brew link node@12

```

&nbsp;

&nbsp;

---

<div class="post-metadata">

### Author: ![MatthiasH](https://avatars.discourse-cdn.com/v4/letter/m/47e85d/32.png) [@MatthiasH](https://forum.shopware.com/u/MatthiasH)
#### Post date: [18. Februar 2021 um 21:10 UTC](https://forum.shopware.com/t/fehler-bei-installation-mamp-pro-macos-bigsur/72815/3 "2021-02-18T21:10:09Z")

</div>

Hmm mit Node12 komme ich auch nicht weiter. Hängt sich immer noch auf.&nbsp;
